{"text_format":"1","workbook":"xlsx","n_sheets":6,"sheets":["Introduction","Obtain Constants","Conversion Curve","Obtain Comp. Strength","Calculations","Sheet1"],"not_rendered":{"charts":1,"images":5,"macros":1,"external_links":0,"defined_names":2,"comments":0,"pivot_tables":0},"unopened":[],"bounds":{"document_bytes":16777216,"sheet_cells":100000,"rows_first":2000,"rows_last":500,"rows_between":2000,"halvings":0,"cell_chars":16384,"cell_head_chars":4096},"cells_cut":0,"cells_raw":0,"read":"whole","date_system":"1900"}

{"sheet":"Introduction","index":0,"n_rows":401,"n_cols":3,"rows_kept":401,"cut":false,"hidden":false,"merged":[[3,1,3,2],[0,1,0,2]]}
[]
[]
[]
[]
[]
[]
[]
[]
[]
[]
[]
[]
[]
[]
[]
[]
[]
[]
[]
[]
[]
[]
[]
[]
[]
[]
[]
[]
[]
[]
[]
[]
[]
[]
[]
[]
[]
[]
[]
[]
[]
[]
[]
[]
[]
[]
[]
[]
[]
[]
[]
[]
[]
[]
[]
[]
[]
[]
[]
[]
{"$rows_left_out":342}
{"sheet":"Obtain Constants","index":1,"n_rows":38,"n_cols":6,"rows_kept":38,"cut":false,"hidden":false,"merged":[[34,3,35,3],[3,1,3,3],[0,1,0,8],[31,4,32,4],[4,1,5,1],[4,5,34,5]]}
[]
[]
[]
[null,"TABLE 1: Obtain Constants"]
[null,"Sample No.","Compressive Strength fck","Pundit Values Velocity V",null,"Step 1: Select up to twenty (20) test points from different areas that you want to include in the co-relation (minimum of five (5) test points required, may also be used on standard cubes or cylinders).\n\nStep 2: Obtain Pundit Values at these points.\n\nStep 3: Extract concrete core samples from the selected test areas. The concrete cores should not have any reinforcing bars within the core.\n\nStep 4: Perform compressive strength test method on the cores under similar field conditions. \n\nStep 5: Input in the grey dark cells of Table 1 the units for the Compressive Strength (MPa or PSI) and the Pundit Values (m/s or ft/s).\n\nStep 6: Input now the obtained Compressive Strength and the Pundit Values. In the first row (Sample No. 1) insert the values with the lowest Pundit Value Velocity and in the last row (Sample No. 20) the values with the highest Pundit Value Velocity. Afterwards continue with inserting the values from Sample No. 2 onwards. Input at least totally five (5) rows of data.\n\nStep 7: Once the input data is complete, press control shift T (CTRL-SHIFT-T) or press the button below:\n\n\n\n\nStep 8: To create and to see the shape of the conversion curve continue with the sheet \"Conversion Curve\".\n\nStep 9: Once you have the constants, select the sheet \"Obtain Comp. Strength\", where you have to manually input the reading from the Pundit to obtain the Compressive Strength at that test point.\n\nNOTE: If the R-Square value falls below 80% (0.80 or less), additional testing samples are recommended. Then repeat steps 1 through 7.\n"]
[null,null,"PSI or MPa","ft/s or m/s"]
[null,"1 (Lowest)",null,null," "]
[null,2]
[null,{"$f":"B8+1","v":3}]
[null,4]
[null,5]
[null,6]
[null,7]
[null,8]
[null,9]
[null,10]
[null,11]
[null,12]
[null,13]
[null,14]
[null,15]
[null,16]
[null,17]
[null,18]
[null,19]
[null,"20 (Highest)"]
[]
[]
[]
[null,null,"Constants"," Curve Type: \nExponential"]
[null,null,"a",{"$f":"Calculations!K6","v":{"$error":"#VALUE!"}}]
[null,null,"b",{"$f":"Calculations!I6","v":{"$error":"#VALUE!"}}]
[null,null,"R-Square",{"$f":"Calculations!I8","v":{"$error":"#VALUE!"}}]
[]
[null,null,null,"fc = a*Vb"]
[]
[]
[null,null," "]

{"sheet":"Conversion Curve","index":2,"n_rows":34,"n_cols":10,"rows_kept":34,"cut":false,"hidden":false,"merged":[[0,0,0,9],[3,1,4,1],[3,2,4,2],[1,0,1,9],[3,0,5,0],[2,0,2,2]]}
["                                                      "]
["The conversion curve is automatically generated with the coefficient obtained.\nIt is an exponential curve with the formula shown below. The range of the applicable \ncurve is defined by the values inserted in Table 1 (in the worksheet \"Obtain Constants\").\n"]
["TABLE 2",null,null,null,"Conversion Curve",null,"fc =",{"$f":"'Obtain Constants'!D31","v":{"$error":"#VALUE!"}},"*V",{"$f":"'Obtain Constants'!D32","v":{"$error":"#VALUE!"}}]
["Curve Points","Pundit Values Velocity V ","Compr. Strength fck "]
[]
[null,{"$f":"'Obtain Constants'!D6","v":"ft/s or m/s"},{"$f":"'Obtain Constants'!C6","v":"PSI or MPa"}]
["Lowest",{"$f":"'Obtain Constants'!$D$7","v":0},{"$f":"(IF(B7=\"\",\"\",'Obtain Constants'!$D$31*EXP('Obtain Constants'!$D$32*B7)))","v":{"$error":"#VALUE!"}}]
[null,{"$f":"B7+(B$27-B$7)/20","v":0},{"$f":"(IF(B8=\"\",\"\",'Obtain Constants'!$D$31*EXP('Obtain Constants'!$D$32*B8)))","v":{"$error":"#VALUE!"}}]
[null,{"$f":"B8+(B$27-B$7)/20","v":0},{"$f":"(IF(B9=\"\",\"\",'Obtain Constants'!$D$31*EXP('Obtain Constants'!$D$32*B9)))","v":{"$error":"#VALUE!"}}]
[null,0,{"$f":"(IF(B10=\"\",\"\",'Obtain Constants'!$D$31*EXP('Obtain Constants'!$D$32*B10)))","v":{"$error":"#VALUE!"}}]
[null,0,{"$f":"(IF(B11=\"\",\"\",'Obtain Constants'!$D$31*EXP('Obtain Constants'!$D$32*B11)))","v":{"$error":"#VALUE!"}}]
[null,0,{"$f":"(IF(B12=\"\",\"\",'Obtain Constants'!$D$31*EXP('Obtain Constants'!$D$32*B12)))","v":{"$error":"#VALUE!"}}]
[null,0,{"$f":"(IF(B13=\"\",\"\",'Obtain Constants'!$D$31*EXP('Obtain Constants'!$D$32*B13)))","v":{"$error":"#VALUE!"}}]
[null,0,{"$f":"(IF(B14=\"\",\"\",'Obtain Constants'!$D$31*EXP('Obtain Constants'!$D$32*B14)))","v":{"$error":"#VALUE!"}}]
[null,0,{"$f":"(IF(B15=\"\",\"\",'Obtain Constants'!$D$31*EXP('Obtain Constants'!$D$32*B15)))","v":{"$error":"#VALUE!"}}]
[null,0,{"$f":"(IF(B16=\"\",\"\",'Obtain Constants'!$D$31*EXP('Obtain Constants'!$D$32*B16)))","v":{"$error":"#VALUE!"}}]
[null,0,{"$f":"(IF(B17=\"\",\"\",'Obtain Constants'!$D$31*EXP('Obtain Constants'!$D$32*B17)))","v":{"$error":"#VALUE!"}}]
[null,0,{"$f":"(IF(B18=\"\",\"\",'Obtain Constants'!$D$31*EXP('Obtain Constants'!$D$32*B18)))","v":{"$error":"#VALUE!"}}]
[null,0,{"$f":"(IF(B19=\"\",\"\",'Obtain Constants'!$D$31*EXP('Obtain Constants'!$D$32*B19)))","v":{"$error":"#VALUE!"}}]
[null,0,{"$f":"(IF(B20=\"\",\"\",'Obtain Constants'!$D$31*EXP('Obtain Constants'!$D$32*B20)))","v":{"$error":"#VALUE!"}}]
[null,0,{"$f":"(IF(B21=\"\",\"\",'Obtain Constants'!$D$31*EXP('Obtain Constants'!$D$32*B21)))","v":{"$error":"#VALUE!"}}]
[null,0,{"$f":"(IF(B22=\"\",\"\",'Obtain Constants'!$D$31*EXP('Obtain Constants'!$D$32*B22)))","v":{"$error":"#VALUE!"}}]
[null,0,{"$f":"(IF(B23=\"\",\"\",'Obtain Constants'!$D$31*EXP('Obtain Constants'!$D$32*B23)))","v":{"$error":"#VALUE!"}}]
[null,0,{"$f":"(IF(B24=\"\",\"\",'Obtain Constants'!$D$31*EXP('Obtain Constants'!$D$32*B24)))","v":{"$error":"#VALUE!"}}]
[null,0,{"$f":"(IF(B25=\"\",\"\",'Obtain Constants'!$D$31*EXP('Obtain Constants'!$D$32*B25)))","v":{"$error":"#VALUE!"}}]
[null,0,{"$f":"(IF(B26=\"\",\"\",'Obtain Constants'!$D$31*EXP('Obtain Constants'!$D$32*B26)))","v":{"$error":"#VALUE!"}}]
["Highest",{"$f":"'Obtain Constants'!D26","v":0},{"$f":"(IF(B27=\"\",\"\",'Obtain Constants'!$D$31*EXP('Obtain Constants'!$D$32*B27)))","v":{"$error":"#VALUE!"}}]
[]
[null,null,null,null,"You may have to adjust the range of the horizontal and/or vertical axis:  "]
[]
[null,null,null,null,"1. Click on the \"Conversion Curve\" chart above"]
[null,null,null,null,"2. Right mouse click on the chart"]
[null,null,null,null,"3. Click on \"Format Axis\" "]
[null,null,null,null,"4. Change the parameters under \"Axis Options\""]

{"sheet":"Obtain Comp. Strength","index":3,"n_rows":104,"n_cols":5,"rows_kept":104,"cut":false,"hidden":false,"merged":[[0,0,0,5],[1,1,1,4],[3,0,4,0],[3,4,23,4]]}
["                                                      "]
[]
["TABLE 3: Obtain Compressive Strength"]
["Data Point No.","Compressive Strength fck ","Pundit Values Velocity V",null,"This sheet is designed to assist you in determining the Compressive Strength of concrete.\n\nIn case you want to create and to see the shape of  the conversion curve first continue with the sheet \"Conversion Curve\".\n\nInput the Pundit Values (white cells) in your selected unit (m/s or ft/s). Up to 100 data points may be inserted.   \n\nNOTE : Input only values within the range of column B of Table 2 in the \"Conversion Curve\" sheet.\n\nThe derived Compressive Strength will be displayed automatically in the grey column in the selected unit (MPa or PSI).\n"]
[null,{"$f":"'Obtain Constants'!C6","v":"PSI or MPa"},{"$f":"'Obtain Constants'!D6","v":"ft/s or m/s"}]
[{"$f":"A5+1","v":1},{"$f":"(IF(C6=\"\",\"\",'Obtain Constants'!$D$31*EXP('Obtain Constants'!$D$32*C6)))","v":""}]
[{"$f":"A6+1","v":2},{"$f":"(IF(C7=\"\",\"\",'Obtain Constants'!$D$31*EXP('Obtain Constants'!$D$32*C7)))","v":""}]
[3,{"$f":"(IF(C8=\"\",\"\",'Obtain Constants'!$D$31*EXP('Obtain Constants'!$D$32*C8)))","v":""}]
[4,{"$f":"(IF(C9=\"\",\"\",'Obtain Constants'!$D$31*EXP('Obtain Constants'!$D$32*C9)))","v":""}]
[5,{"$f":"(IF(C10=\"\",\"\",'Obtain Constants'!$D$31*EXP('Obtain Constants'!$D$32*C10)))","v":""}]
[6,{"$f":"(IF(C11=\"\",\"\",'Obtain Constants'!$D$31*EXP('Obtain Constants'!$D$32*C11)))","v":""}]
[7,{"$f":"(IF(C12=\"\",\"\",'Obtain Constants'!$D$31*EXP('Obtain Constants'!$D$32*C12)))","v":""}]
[8,{"$f":"(IF(C13=\"\",\"\",'Obtain Constants'!$D$31*EXP('Obtain Constants'!$D$32*C13)))","v":""}]
[9,{"$f":"(IF(C14=\"\",\"\",'Obtain Constants'!$D$31*EXP('Obtain Constants'!$D$32*C14)))","v":""}]
[10,{"$f":"(IF(C15=\"\",\"\",'Obtain Constants'!$D$31*EXP('Obtain Constants'!$D$32*C15)))","v":""}]
[11,{"$f":"(IF(C16=\"\",\"\",'Obtain Constants'!$D$31*EXP('Obtain Constants'!$D$32*C16)))","v":""}]
[12,{"$f":"(IF(C17=\"\",\"\",'Obtain Constants'!$D$31*EXP('Obtain Constants'!$D$32*C17)))","v":""}]
[13,{"$f":"(IF(C18=\"\",\"\",'Obtain Constants'!$D$31*EXP('Obtain Constants'!$D$32*C18)))","v":""}]
[14,{"$f":"(IF(C19=\"\",\"\",'Obtain Constants'!$D$31*EXP('Obtain Constants'!$D$32*C19)))","v":""}]
[15,{"$f":"(IF(C20=\"\",\"\",'Obtain Constants'!$D$31*EXP('Obtain Constants'!$D$32*C20)))","v":""}]
[16,{"$f":"(IF(C21=\"\",\"\",'Obtain Constants'!$D$31*EXP('Obtain Constants'!$D$32*C21)))","v":""}]
[17,{"$f":"(IF(C22=\"\",\"\",'Obtain Constants'!$D$31*EXP('Obtain Constants'!$D$32*C22)))","v":""}]
[18,{"$f":"(IF(C23=\"\",\"\",'Obtain Constants'!$D$31*EXP('Obtain Constants'!$D$32*C23)))","v":""}]
[19,{"$f":"(IF(C24=\"\",\"\",'Obtain Constants'!$D$31*EXP('Obtain Constants'!$D$32*C24)))","v":""}]
[20,{"$f":"(IF(C25=\"\",\"\",'Obtain Constants'!$D$31*EXP('Obtain Constants'!$D$32*C25)))","v":""}]
[21,{"$f":"(IF(C26=\"\",\"\",'Obtain Constants'!$D$31*EXP('Obtain Constants'!$D$32*C26)))","v":""}]
[22,{"$f":"(IF(C27=\"\",\"\",'Obtain Constants'!$D$31*EXP('Obtain Constants'!$D$32*C27)))","v":""}]
[23,{"$f":"(IF(C28=\"\",\"\",'Obtain Constants'!$D$31*EXP('Obtain Constants'!$D$32*C28)))","v":""}]
[24,{"$f":"(IF(C29=\"\",\"\",'Obtain Constants'!$D$31*EXP('Obtain Constants'!$D$32*C29)))","v":""}]
[25,{"$f":"(IF(C30=\"\",\"\",'Obtain Constants'!$D$31*EXP('Obtain Constants'!$D$32*C30)))","v":""}]
[26,{"$f":"(IF(C31=\"\",\"\",'Obtain Constants'!$D$31*EXP('Obtain Constants'!$D$32*C31)))","v":""}]
[27,{"$f":"(IF(C32=\"\",\"\",'Obtain Constants'!$D$31*EXP('Obtain Constants'!$D$32*C32)))","v":""}]
[28,{"$f":"(IF(C33=\"\",\"\",'Obtain Constants'!$D$31*EXP('Obtain Constants'!$D$32*C33)))","v":""}]
[29,{"$f":"(IF(C34=\"\",\"\",'Obtain Constants'!$D$31*EXP('Obtain Constants'!$D$32*C34)))","v":""}]
[30,{"$f":"(IF(C35=\"\",\"\",'Obtain Constants'!$D$31*EXP('Obtain Constants'!$D$32*C35)))","v":""}]
[31,{"$f":"(IF(C36=\"\",\"\",'Obtain Constants'!$D$31*EXP('Obtain Constants'!$D$32*C36)))","v":""}]
[32,{"$f":"(IF(C37=\"\",\"\",'Obtain Constants'!$D$31*EXP('Obtain Constants'!$D$32*C37)))","v":""}]
[33,{"$f":"(IF(C38=\"\",\"\",'Obtain Constants'!$D$31*EXP('Obtain Constants'!$D$32*C38)))","v":""}]
[34,{"$f":"(IF(C39=\"\",\"\",'Obtain Constants'!$D$31*EXP('Obtain Constants'!$D$32*C39)))","v":""}]
[35,{"$f":"(IF(C40=\"\",\"\",'Obtain Constants'!$D$31*EXP('Obtain Constants'!$D$32*C40)))","v":""}]
[36,{"$f":"(IF(C41=\"\",\"\",'Obtain Constants'!$D$31*EXP('Obtain Constants'!$D$32*C41)))","v":""}]
[37,{"$f":"(IF(C42=\"\",\"\",'Obtain Constants'!$D$31*EXP('Obtain Constants'!$D$32*C42)))","v":""}]
[38,{"$f":"(IF(C43=\"\",\"\",'Obtain Constants'!$D$31*EXP('Obtain Constants'!$D$32*C43)))","v":""}]
[39,{"$f":"(IF(C44=\"\",\"\",'Obtain Constants'!$D$31*EXP('Obtain Constants'!$D$32*C44)))","v":""}]
[40,{"$f":"(IF(C45=\"\",\"\",'Obtain Constants'!$D$31*EXP('Obtain Constants'!$D$32*C45)))","v":""}]
[41,{"$f":"(IF(C46=\"\",\"\",'Obtain Constants'!$D$31*EXP('Obtain Constants'!$D$32*C46)))","v":""}]
[42,{"$f":"(IF(C47=\"\",\"\",'Obtain Constants'!$D$31*EXP('Obtain Constants'!$D$32*C47)))","v":""}]
[43,{"$f":"(IF(C48=\"\",\"\",'Obtain Constants'!$D$31*EXP('Obtain Constants'!$D$32*C48)))","v":""}]
[44,{"$f":"(IF(C49=\"\",\"\",'Obtain Constants'!$D$31*EXP('Obtain Constants'!$D$32*C49)))","v":""}]
[45,{"$f":"(IF(C50=\"\",\"\",'Obtain Constants'!$D$31*EXP('Obtain Constants'!$D$32*C50)))","v":""}]
[46,{"$f":"(IF(C51=\"\",\"\",'Obtain Constants'!$D$31*EXP('Obtain Constants'!$D$32*C51)))","v":""}]
[47,{"$f":"(IF(C52=\"\",\"\",'Obtain Constants'!$D$31*EXP('Obtain Constants'!$D$32*C52)))","v":""}]
[48,{"$f":"(IF(C53=\"\",\"\",'Obtain Constants'!$D$31*EXP('Obtain Constants'!$D$32*C53)))","v":""}]
[49,{"$f":"(IF(C54=\"\",\"\",'Obtain Constants'!$D$31*EXP('Obtain Constants'!$D$32*C54)))","v":""}]
[50,{"$f":"(IF(C55=\"\",\"\",'Obtain Constants'!$D$31*EXP('Obtain Constants'!$D$32*C55)))","v":""}]
[51,{"$f":"(IF(C56=\"\",\"\",'Obtain Constants'!$D$31*EXP('Obtain Constants'!$D$32*C56)))","v":""}]
[52,{"$f":"(IF(C57=\"\",\"\",'Obtain Constants'!$D$31*EXP('Obtain Constants'!$D$32*C57)))","v":""}]
[53,{"$f":"(IF(C58=\"\",\"\",'Obtain Constants'!$D$31*EXP('Obtain Constants'!$D$32*C58)))","v":""}]
[54,{"$f":"(IF(C59=\"\",\"\",'Obtain Constants'!$D$31*EXP('Obtain Constants'!$D$32*C59)))","v":""}]
[55,{"$f":"(IF(C60=\"\",\"\",'Obtain Constants'!$D$31*EXP('Obtain Constants'!$D$32*C60)))","v":""}]
{"$rows_left_out":45}
{"sheet":"Calculations","index":4,"n_rows":154,"n_cols":13,"rows_kept":154,"cut":false,"hidden":true,"merged":[]}
[]
[]
[]
[]
[null,null,null,null,null,null,null,null,"b",null,"a"]
[null,null,null,null,null,null,null,null,{"$f":"LINEST(LN(D7:D11),E7:E11,TRUE,TRUE)","v":{"$error":"#VALUE!"}},{"$error":"#VALUE!"},{"$f":"EXP(J6)","v":{"$error":"#VALUE!"}}]
[null,null,null,{"$f":"('Obtain Constants'!C7)","v":0},{"$f":"('Obtain Constants'!D7)","v":0},null,null,null,{"$error":"#VALUE!"},{"$error":"#VALUE!"}]
[null,null,null,{"$f":"('Obtain Constants'!C8)","v":0},{"$f":"('Obtain Constants'!D8)","v":0},null,null,null,{"$error":"#VALUE!"},{"$error":"#VALUE!"}]
[null,null,null,{"$f":"('Obtain Constants'!C9)","v":0},{"$f":"('Obtain Constants'!D9)","v":0},null,null,null,{"$error":"#VALUE!"},{"$error":"#VALUE!"}]
[null,null,null,{"$f":"('Obtain Constants'!C10)","v":0},{"$f":"('Obtain Constants'!D10)","v":0},null,null,null,{"$error":"#VALUE!"},{"$error":"#VALUE!"}]
[null,null,null,{"$f":"('Obtain Constants'!C11)","v":0},{"$f":"('Obtain Constants'!D11)","v":0}]
[null,null,null,{"$f":"('Obtain Constants'!C12)","v":0},{"$f":"('Obtain Constants'!D12)","v":0},null,null,null,{"$f":"('Obtain Constants'!E9)","v":0}]
[null,null,null,null,null,null,null,null,{"$f":"('Obtain Constants'!E10)","v":0}]
[null,null,null,null,null,null,null,null,{"$f":"('Obtain Constants'!E11)","v":0}]
[null,null,null,null,null,null,null,null,{"$f":"('Obtain Constants'!E12)","v":0}]
[null,null,null,null,null,null,null,null,{"$f":"('Obtain Constants'!E13)","v":0}]
[null,null,null,null,null,null,null,null,{"$f":"('Obtain Constants'!E14)","v":0}]
[null,null,null,null,null,null,null,null,{"$f":"('Obtain Constants'!E15)","v":0}]
[null,null,null,null,null,null,null,null,{"$f":"('Obtain Constants'!E16)","v":0}]
[null,null,null,null,null,null,null,null,{"$f":"('Obtain Constants'!E17)","v":0}]
[null,null,null,null,null,null,null,null,{"$f":"('Obtain Constants'!E18)","v":0}]
[null,null,null,null,null,null,null,null,{"$f":"('Obtain Constants'!E19)","v":0}]
[null,null,null,null,null,null,null,null,{"$f":"('Obtain Constants'!E20)","v":0}]
[null,null,null,null,null,null,null,null,{"$f":"+LINEST(D7:D22,E7:E22^COLUMN($A:$B),TRUE,TRUE)","v":{"$error":"#VALUE!"}},{"$error":"#VALUE!"},{"$error":"#VALUE!"}]
[null,null,null,null,null,null,null,null,{"$error":"#VALUE!"},{"$error":"#VALUE!"},{"$error":"#VALUE!"}]
[null,null,null,null,null,null,null,null,{"$error":"#VALUE!"},{"$error":"#VALUE!"},{"$error":"#VALUE!"}]
[null,null,null,null,null,null,null,null,{"$error":"#VALUE!"},{"$error":"#VALUE!"},{"$error":"#VALUE!"}]
[null,null,null,{"$f":"COUNT(D7:D26)","v":6},null,null,null,null,{"$error":"#VALUE!"},{"$error":"#VALUE!"},{"$error":"#VALUE!"}]
[]
[]
[]
[]
[]
[]
[]
[]
[]
[]
[]
[]
[]
[]
[]
[]
[]
[]
[]
[null,null,null,null,null,null,null,null,null,null,null,null,{"$f":"'Obtain Comp. Strength'!$C47^2*Calculations!$I$6+Calculations!$J$6*'Obtain Comp. Strength'!$C47+Calculations!$K$6","v":{"$error":"#VALUE!"}}]
[null,null,null,null,null,null,null,null,null,null,null,null,{"$f":"'Obtain Comp. Strength'!$C48^2*Calculations!$I$6+Calculations!$J$6*'Obtain Comp. Strength'!$C48+Calculations!$K$6","v":{"$error":"#VALUE!"}}]
[null,null,null,null,null,null,null,null,null,null,null,null,{"$f":"'Obtain Comp. Strength'!$C49^2*Calculations!$I$6+Calculations!$J$6*'Obtain Comp. Strength'!$C49+Calculations!$K$6","v":{"$error":"#VALUE!"}}]
[null,null,null,null,null,null,null,null,null,null,null,null,{"$f":"'Obtain Comp. Strength'!$C50^2*Calculations!$I$6+Calculations!$J$6*'Obtain Comp. Strength'!$C50+Calculations!$K$6","v":{"$error":"#VALUE!"}}]
[null,null,null,null,null,null,null,null,null,null,null,null,{"$f":"'Obtain Comp. Strength'!$C51^2*Calculations!$I$6+Calculations!$J$6*'Obtain Comp. Strength'!$C51+Calculations!$K$6","v":{"$error":"#VALUE!"}}]
[null,null,null,null,null,null,null,null,null,null,null,null,{"$f":"'Obtain Comp. Strength'!$C52^2*Calculations!$I$6+Calculations!$J$6*'Obtain Comp. Strength'!$C52+Calculations!$K$6","v":{"$error":"#VALUE!"}}]
[null,null,null,null,null,null,null,null,null,null,null,null,{"$f":"'Obtain Comp. Strength'!$C53^2*Calculations!$I$6+Calculations!$J$6*'Obtain Comp. Strength'!$C53+Calculations!$K$6","v":{"$error":"#VALUE!"}}]
[null,null,null,null,null,null,null,null,null,null,null,null,{"$f":"'Obtain Comp. Strength'!$C54^2*Calculations!$I$6+Calculations!$J$6*'Obtain Comp. Strength'!$C54+Calculations!$K$6","v":{"$error":"#VALUE!"}}]
[null,null,null,null,null,null,null,null,null,null,null,null,{"$f":"'Obtain Comp. Strength'!$C55^2*Calculations!$I$6+Calculations!$J$6*'Obtain Comp. Strength'!$C55+Calculations!$K$6","v":{"$error":"#VALUE!"}}]
[null,null,null,null,null,null,null,null,null,null,null,null,{"$f":"'Obtain Comp. Strength'!$C56^2*Calculations!$I$6+Calculations!$J$6*'Obtain Comp. Strength'!$C56+Calculations!$K$6","v":{"$error":"#VALUE!"}}]
[null,null,null,null,null,null,null,null,null,null,null,null,{"$f":"'Obtain Comp. Strength'!$C57^2*Calculations!$I$6+Calculations!$J$6*'Obtain Comp. Strength'!$C57+Calculations!$K$6","v":{"$error":"#VALUE!"}}]
[null,null,null,null,null,null,null,null,null,null,null,null,{"$f":"'Obtain Comp. Strength'!$C58^2*Calculations!$I$6+Calculations!$J$6*'Obtain Comp. Strength'!$C58+Calculations!$K$6","v":{"$error":"#VALUE!"}}]
[null,null,null,null,null,null,null,null,null,null,null,null,{"$f":"'Obtain Comp. Strength'!$C59^2*Calculations!$I$6+Calculations!$J$6*'Obtain Comp. Strength'!$C59+Calculations!$K$6","v":{"$error":"#VALUE!"}}]
{"$rows_left_out":95}
{"sheet":"Sheet1","index":5,"n_rows":26,"n_cols":13,"rows_kept":26,"cut":false,"hidden":true,"merged":[]}
[]
[null,null,null,null,null,null,null,"Mean B",{"$f":"AVERAGE(B7:B26)","v":39.92},null,null,"Mean C",{"$f":"+AVERAGE(C7:C26)","v":40.679999999999993}]
[null,null,null,null,null,null,null,"SD B",{"$f":"+STDEV(B7:B26)","v":22.584708380485662},null,null,"SD C",{"$f":"STDEV(C7:C26)","v":22.103979160704135}]
[]
[null,null,null,null,null,null,null,"Compressive Strenght",null,null,null,"SilverSch"]
[null,"Comp St","SS",null,null,null,null,"Z","Outlayer Z>3",null,null,"Z","Outlayer Z>3"]
[{"$f":"'Obtain Constants'!B7","v":"1 (Lowest)"},29.5,35.799999999999997,null,null,null,null,{"$f":"(B7-$I$2)/$I$3","v":-0.46137412201449601},{"$f":"ABS(H7)>1.5","v":false},null,null,{"$f":"(C7-$M$2)/$M$3","v":-0.22077472859165237},{"$f":"ABS(L7)>1.5","v":false}]
[{"$f":"'Obtain Constants'!B8","v":2},32.6,37.5,null,null,null,null,-0.32411310682784167,{"$f":"ABS(H8)>1.5","v":false},null,null,{"$f":"(C8-$M$2)/$M$3","v":-0.14386549936915033},{"$f":"ABS(L8)>1.5","v":false}]
[{"$f":"'Obtain Constants'!B9","v":3},40.299999999999997,45,null,null,null,null,1.6825543797073544E-2,false,null,null,0.19543992367129934,false]
[{"$f":"'Obtain Constants'!B10","v":4},41.2,41.8,null,null,null,null,5.6675515948037936E-2,false,null,null,5.0669609840707355E-2,false]
[{"$f":"'Obtain Constants'!B11","v":5},44.2,49,null,null,null,null,0.18950875645125173,false,null,null,0.37640281595953917,false]
[{"$f":"'Obtain Constants'!B12","v":6},45.3,56,null,null,null,null,0.23821427796909653,false,null,null,0.69308787746395883,false]
[{"$f":"'Obtain Constants'!B13","v":7},48.5,49,null,null,null,null,0.37990306783919137,false,null,null,0.37640281595953917,false]
[{"$f":"'Obtain Constants'!B14","v":8},50.6,46.8,null,null,null,null,0.4728863361914411,false,null,null,0.27687322520100716,false]
[{"$f":"'Obtain Constants'!B15","v":9},51.5,49.5,null,null,null,null,0.51273630834240513,false,null,null,0.39902317749556915,false]
[{"$f":"'Obtain Constants'!B16","v":10},52,56,null,null,null,null,0.53487518175960747,false,null,null,0.69308787746395883,false]
[{"$f":"'Obtain Constants'!B17","v":11},55.8,57.3,null,null,null,null,0.70313061973034485,false,null,null,0.75190081745763671,false]
[{"$f":"'Obtain Constants'!B18","v":12},57,52.8,null,null,null,null,0.75626391593163045,false,null,null,0.54831756363336681,false]
[{"$f":"'Obtain Constants'!B19","v":13},58.1,56.5,null,null,null,null,0.80496943744947558,false,null,null,0.71570823899998881,false]
[{"$f":"'Obtain Constants'!B20","v":14},60.9,65.5,null,null,null,null,0.9289471285858083,false,null,null,1.1228747466485285,false]
[{"$f":"'Obtain Constants'!B21","v":15},62.3,53.8,null,null,null,null,0.99093597415397472,false,null,null,0.59355828670542676,false]
[{"$f":"'Obtain Constants'!B22","v":16},68.599999999999994,61.3,null,null,null,null,1.2698857792107237,false,null,null,0.93286370974587651,false]
[{"$f":"'Obtain Constants'!B23","v":17},{"$f":"'Obtain Constants'!C23","v":0},{"$f":"'Obtain Constants'!D23","v":0},null,null,null,null,-1.7675676536294316,true,null,null,-1.8403926145713987,true]
[{"$f":"'Obtain Constants'!B24","v":18},{"$f":"'Obtain Constants'!C24","v":0},{"$f":"'Obtain Constants'!D24","v":0},null,null,null,null,-1.7675676536294316,true,null,null,-1.8403926145713987,true]
[{"$f":"'Obtain Constants'!B25","v":19},{"$f":"'Obtain Constants'!C25","v":0},{"$f":"'Obtain Constants'!D25","v":0},null,null,null,null,-1.7675676536294316,true,null,null,-1.8403926145713987,true]
[{"$f":"'Obtain Constants'!B26","v":"20 (Highest)"},{"$f":"'Obtain Constants'!C26","v":0},{"$f":"'Obtain Constants'!D26","v":0},null,null,null,null,-1.7675676536294316,true,null,null,-1.8403926145713987,true]