{"text_format":"1","workbook":"xlsx","n_sheets":4,"sheets":["Obtain constants","Obtain Comp. Strength","Calculations","Sheet1"],"not_rendered":{"charts":0,"images":2,"macros":1,"external_links":0,"defined_names":0,"comments":0,"pivot_tables":0},"unopened":[],"bounds":{"document_bytes":16777216,"sheet_cells":100000,"rows_first":2000,"rows_last":500,"rows_between":2000,"halvings":0,"cell_chars":16384,"cell_head_chars":4096},"cells_cut":0,"cells_raw":0,"read":"whole","date_system":"1900"}

{"sheet":"Obtain constants","index":0,"n_rows":38,"n_cols":5,"rows_kept":38,"cut":false,"hidden":false,"merged":[[0,0,0,8],[4,3,5,3],[4,2,5,2],[4,1,5,1]]}
[]
[]
[null,null,"TABELLE 1"]
[]
[null,"Testpunkt Nr.","Druckfestigkeit fck (MPa or PSI)","Silver-/Original Schmidt  \nRuckprallwerte (S)"]
[null,null,null,null," "]
[null,1]
[null,{"$f":"B7+1","v":2}]
[null,{"$f":"B8+1","v":3}]
[null,4]
[null,5]
[null,6]
[null,7]
[null,8]
[null,9]
[null,10]
[null,11]
[null,12]
[null,13]
[null,14]
[null,15]
[null,16]
[null,17]
[null,18]
[null,19]
[null,20]
[]
[]
[]
[null,null,"Konstanten"," der Polynomial-Kurve"]
[null,null,"a=",{"$f":"+IF(Calculations!$I$8<Calculations!$O$8,Calculations!O6,Calculations!I6)","v":0}]
[null,null,"b=",{"$f":"+IF(Calculations!$I$8<Calculations!$O$8,Calculations!P6,Calculations!J6)","v":0}]
[null,null,"c=",{"$f":"+IF(Calculations!$I$8<Calculations!$O$8,Calculations!Q6,Calculations!K6)","v":0}]
[null,null,"d=",{"$f":"+IF(Calculations!$I$8<Calculations!$O$8,Calculations!R6,\"\")","v":""}]
[]
[]
[]
[null,null," "]

{"sheet":"Obtain Comp. Strength","index":1,"n_rows":105,"n_cols":3,"rows_kept":105,"cut":false,"hidden":false,"merged":[[3,1,4,1],[3,2,4,2],[0,0,0,5]]}
["                                                       Bestimmung der Druckfestigkeit"]
[]
[null,"TABELLE 2"]
["Datensatz Nr.","Druckfestigkeit fck    (MPa oder PSI)","Silver-/Original Schmidt  \nRückprallwerte (S)"]
[]
[1]
[{"$f":"A6+1","v":2}]
[{"$f":"A7+1","v":3}]
[4]
[5]
[6]
[7]
[8]
[9]
[10]
[11]
[12]
[13]
[14,{"$f":"IF(C19<>\"\",Calculations!T19,\"\")","v":""}]
[15,{"$f":"IF(C20<>\"\",Calculations!T20,\"\")","v":""}]
[16,{"$f":"IF(C21<>\"\",Calculations!T21,\"\")","v":""}]
[17,{"$f":"IF(C22<>\"\",Calculations!T22,\"\")","v":""}]
[18,{"$f":"IF(C23<>\"\",Calculations!T23,\"\")","v":""}]
[19,{"$f":"IF(C24<>\"\",Calculations!T24,\"\")","v":""}]
[20,{"$f":"IF(C25<>\"\",Calculations!T25,\"\")","v":""}]
[21,{"$f":"IF(C26<>\"\",Calculations!T26,\"\")","v":""}]
[22,{"$f":"IF(C27<>\"\",Calculations!T27,\"\")","v":""}]
[23,{"$f":"IF(C28<>\"\",Calculations!T28,\"\")","v":""}]
[24,{"$f":"IF(C29<>\"\",Calculations!T29,\"\")","v":""}]
[25,{"$f":"IF(C30<>\"\",Calculations!T30,\"\")","v":""}]
[26,{"$f":"IF(C31<>\"\",Calculations!T31,\"\")","v":""}]
[27,{"$f":"IF(C32<>\"\",Calculations!T32,\"\")","v":""}]
[28,{"$f":"IF(C33<>\"\",Calculations!T33,\"\")","v":""}]
[29,{"$f":"IF(C34<>\"\",Calculations!T34,\"\")","v":""}]
[30,{"$f":"IF(C35<>\"\",Calculations!T35,\"\")","v":""}]
[31,{"$f":"IF(C36<>\"\",Calculations!T36,\"\")","v":""}]
[32,{"$f":"IF(C37<>\"\",Calculations!T37,\"\")","v":""}]
[33,{"$f":"IF(C38<>\"\",Calculations!T38,\"\")","v":""}]
[34,{"$f":"IF(C39<>\"\",Calculations!T39,\"\")","v":""}]
[35,{"$f":"IF(C40<>\"\",Calculations!T40,\"\")","v":""}]
{"$rows_left_out":66}
{"sheet":"Calculations","index":2,"n_rows":154,"n_cols":20,"rows_kept":154,"cut":false,"hidden":true,"merged":[]}
[]
[]
[]
[]
[null,null,null,null,null,null,null,null,null,null,null,null,null,null,"3rd tier"]
[null,null,null,null,null,null,null,null,{"$f":"LINEST(D7:D13,E7:E13^COLUMN($A:$B),TRUE,TRUE)","v":0},0,0,null,{"$f":"'Obtain Comp. Strength'!$C6^2*Calculations!$I$6+Calculations!$J$6*'Obtain Comp. Strength'!$C6+Calculations!$K$6","v":0},null,{"$f":"LINEST(D7:D16,E7:E16^COLUMN($A:$C),TRUE,TRUE)","v":0},0,0,0,null,{"$f":"'Obtain Comp. Strength'!$C6^2*Calculations!$P$6+Calculations!$Q$6*'Obtain Comp. Strength'!$C6+Calculations!$R$6+Calculations!$O$6*'Obtain Comp. Strength'!$C6^3","v":0}]
[null,null,null,{"$f":"('Obtain constants'!C7)","v":0},{"$f":"('Obtain constants'!D7)","v":0},null,null,null,0,0,0,null,{"$f":"'Obtain Comp. Strength'!$C7^2*Calculations!$I$6+Calculations!$J$6*'Obtain Comp. Strength'!$C7+Calculations!$K$6","v":0},null,0,0,0,0,null,{"$f":"'Obtain Comp. Strength'!$C7^2*Calculations!$P$6+Calculations!$Q$6*'Obtain Comp. Strength'!$C7+Calculations!$R$6+Calculations!$O$6*'Obtain Comp. Strength'!$C7^3","v":0}]
[null,null,null,{"$f":"('Obtain constants'!C8)","v":0},{"$f":"('Obtain constants'!D8)","v":0},null,null,null,1,0,{"$error":"#N/A"},null,{"$f":"'Obtain Comp. Strength'!$C8^2*Calculations!$I$6+Calculations!$J$6*'Obtain Comp. Strength'!$C8+Calculations!$K$6","v":0},null,1,0,{"$error":"#N/A"},{"$error":"#N/A"},null,{"$f":"'Obtain Comp. Strength'!$C8^2*Calculations!$P$6+Calculations!$Q$6*'Obtain Comp. Strength'!$C8+Calculations!$R$6+Calculations!$O$6*'Obtain Comp. Strength'!$C8^3","v":0}]
[null,null,null,{"$f":"('Obtain constants'!C9)","v":0},{"$f":"('Obtain constants'!D9)","v":0},null,null,null,{"$error":"#NUM!"},6,{"$error":"#N/A"},null,{"$f":"'Obtain Comp. Strength'!$C9^2*Calculations!$I$6+Calculations!$J$6*'Obtain Comp. Strength'!$C9+Calculations!$K$6","v":0},null,{"$error":"#NUM!"},9,{"$error":"#N/A"},{"$error":"#N/A"},null,{"$f":"'Obtain Comp. Strength'!$C9^2*Calculations!$P$6+Calculations!$Q$6*'Obtain Comp. Strength'!$C9+Calculations!$R$6+Calculations!$O$6*'Obtain Comp. Strength'!$C9^3","v":0}]
[null,null,null,{"$f":"('Obtain constants'!C10)","v":0},{"$f":"('Obtain constants'!D10)","v":0},null,null,null,0,0,{"$error":"#N/A"},null,{"$f":"'Obtain Comp. Strength'!$C10^2*Calculations!$I$6+Calculations!$J$6*'Obtain Comp. Strength'!$C10+Calculations!$K$6","v":0},null,0,0,{"$error":"#N/A"},{"$error":"#N/A"},null,{"$f":"'Obtain Comp. Strength'!$C10^2*Calculations!$P$6+Calculations!$Q$6*'Obtain Comp. Strength'!$C10+Calculations!$R$6+Calculations!$O$6*'Obtain Comp. Strength'!$C10^3","v":0}]
[null,null,null,{"$f":"('Obtain constants'!C11)","v":0},{"$f":"('Obtain constants'!D11)","v":0},null,null,null,{"$f":"('Obtain constants'!E7)","v":0},{"$f":"('Obtain constants'!F7)","v":0},{"$f":"('Obtain constants'!G7)","v":0},null,{"$f":"'Obtain Comp. Strength'!$C11^2*Calculations!$I$6+Calculations!$J$6*'Obtain Comp. Strength'!$C11+Calculations!$K$6","v":0},null,null,null,null,null,null,{"$f":"'Obtain Comp. Strength'!$C11^2*Calculations!$P$6+Calculations!$Q$6*'Obtain Comp. Strength'!$C11+Calculations!$R$6+Calculations!$O$6*'Obtain Comp. Strength'!$C11^3","v":0}]
[null,null,null,{"$f":"('Obtain constants'!C12)","v":0},{"$f":"('Obtain constants'!D12)","v":0},null,null,null,{"$f":"('Obtain constants'!E8)","v":0},null,null,null,{"$f":"'Obtain Comp. Strength'!$C12^2*Calculations!$I$6+Calculations!$J$6*'Obtain Comp. Strength'!$C12+Calculations!$K$6","v":0},null,null,null,null,null,null,{"$f":"'Obtain Comp. Strength'!$C12^2*Calculations!$P$6+Calculations!$Q$6*'Obtain Comp. Strength'!$C12+Calculations!$R$6+Calculations!$O$6*'Obtain Comp. Strength'!$C12^3","v":0}]
[null,null,null,{"$f":"('Obtain constants'!C13)","v":0},{"$f":"('Obtain constants'!D13)","v":0},null,null,null,{"$f":"('Obtain constants'!E9)","v":0},null,null,null,{"$f":"'Obtain Comp. Strength'!$C13^2*Calculations!$I$6+Calculations!$J$6*'Obtain Comp. Strength'!$C13+Calculations!$K$6","v":0},null,null,null,null,null,null,{"$f":"'Obtain Comp. Strength'!$C13^2*Calculations!$P$6+Calculations!$Q$6*'Obtain Comp. Strength'!$C13+Calculations!$R$6+Calculations!$O$6*'Obtain Comp. Strength'!$C13^3","v":0}]
[null,null,null,{"$f":"('Obtain constants'!C14)","v":0},{"$f":"('Obtain constants'!D14)","v":0},null,null,null,{"$f":"('Obtain constants'!E10)","v":0},null,null,null,{"$f":"'Obtain Comp. Strength'!$C14^2*Calculations!$I$6+Calculations!$J$6*'Obtain Comp. Strength'!$C14+Calculations!$K$6","v":0},null,null,null,null,null,null,{"$f":"'Obtain Comp. Strength'!$C14^2*Calculations!$P$6+Calculations!$Q$6*'Obtain Comp. Strength'!$C14+Calculations!$R$6+Calculations!$O$6*'Obtain Comp. Strength'!$C14^3","v":0}]
[null,null,null,{"$f":"('Obtain constants'!C15)","v":0},{"$f":"('Obtain constants'!D15)","v":0},null,null,null,{"$f":"('Obtain constants'!E11)","v":0},null,null,null,{"$f":"'Obtain Comp. Strength'!$C15^2*Calculations!$I$6+Calculations!$J$6*'Obtain Comp. Strength'!$C15+Calculations!$K$6","v":0},null,null,null,null,null,null,{"$f":"'Obtain Comp. Strength'!$C15^2*Calculations!$P$6+Calculations!$Q$6*'Obtain Comp. Strength'!$C15+Calculations!$R$6+Calculations!$O$6*'Obtain Comp. Strength'!$C15^3","v":0}]
[null,null,null,{"$f":"('Obtain constants'!C16)","v":0},{"$f":"('Obtain constants'!D16)","v":0},null,null,null,{"$f":"('Obtain constants'!E12)","v":0},null,null,null,{"$f":"'Obtain Comp. Strength'!$C16^2*Calculations!$I$6+Calculations!$J$6*'Obtain Comp. Strength'!$C16+Calculations!$K$6","v":0},null,null,null,null,null,null,{"$f":"'Obtain Comp. Strength'!$C16^2*Calculations!$P$6+Calculations!$Q$6*'Obtain Comp. Strength'!$C16+Calculations!$R$6+Calculations!$O$6*'Obtain Comp. Strength'!$C16^3","v":0}]
[null,null,null,{"$f":"('Obtain constants'!C17)","v":0},{"$f":"('Obtain constants'!D17)","v":0},null,null,null,{"$f":"('Obtain constants'!E13)","v":0},null,null,null,{"$f":"'Obtain Comp. Strength'!$C17^2*Calculations!$I$6+Calculations!$J$6*'Obtain Comp. Strength'!$C17+Calculations!$K$6","v":0},null,null,null,null,null,null,{"$f":"'Obtain Comp. Strength'!$C17^2*Calculations!$P$6+Calculations!$Q$6*'Obtain Comp. Strength'!$C17+Calculations!$R$6+Calculations!$O$6*'Obtain Comp. Strength'!$C17^3","v":0}]
[null,null,null,null,null,null,null,null,{"$f":"('Obtain constants'!E14)","v":0},null,null,null,{"$f":"'Obtain Comp. Strength'!$C18^2*Calculations!$I$6+Calculations!$J$6*'Obtain Comp. Strength'!$C18+Calculations!$K$6","v":0},null,null,null,null,null,null,{"$f":"'Obtain Comp. Strength'!$C18^2*Calculations!$P$6+Calculations!$Q$6*'Obtain Comp. Strength'!$C18+Calculations!$R$6+Calculations!$O$6*'Obtain Comp. Strength'!$C18^3","v":0}]
[null,null,null,null,null,null,null,null,{"$f":"('Obtain constants'!E15)","v":0},null,null,null,{"$f":"'Obtain Comp. Strength'!$C19^2*Calculations!$I$6+Calculations!$J$6*'Obtain Comp. Strength'!$C19+Calculations!$K$6","v":0},null,null,null,null,null,null,{"$f":"'Obtain Comp. Strength'!$C19^2*Calculations!$P$6+Calculations!$Q$6*'Obtain Comp. Strength'!$C19+Calculations!$R$6+Calculations!$O$6*'Obtain Comp. Strength'!$C19^3","v":0}]
[null,null,null,null,null,null,null,null,{"$f":"('Obtain constants'!E16)","v":0},null,null,null,{"$f":"'Obtain Comp. Strength'!$C20^2*Calculations!$I$6+Calculations!$J$6*'Obtain Comp. Strength'!$C20+Calculations!$K$6","v":0},null,null,null,null,null,null,{"$f":"'Obtain Comp. Strength'!$C20^2*Calculations!$P$6+Calculations!$Q$6*'Obtain Comp. Strength'!$C20+Calculations!$R$6+Calculations!$O$6*'Obtain Comp. Strength'!$C20^3","v":0}]
[null,null,null,null,null,null,null,null,{"$f":"('Obtain constants'!E17)","v":0},null,null,null,{"$f":"'Obtain Comp. Strength'!$C21^2*Calculations!$I$6+Calculations!$J$6*'Obtain Comp. Strength'!$C21+Calculations!$K$6","v":0},null,null,null,null,null,null,{"$f":"'Obtain Comp. Strength'!$C21^2*Calculations!$P$6+Calculations!$Q$6*'Obtain Comp. Strength'!$C21+Calculations!$R$6+Calculations!$O$6*'Obtain Comp. Strength'!$C21^3","v":0}]
[null,null,null,null,null,null,null,null,{"$f":"('Obtain constants'!E18)","v":0},null,null,null,{"$f":"'Obtain Comp. Strength'!$C22^2*Calculations!$I$6+Calculations!$J$6*'Obtain Comp. Strength'!$C22+Calculations!$K$6","v":0},null,null,null,null,null,null,{"$f":"'Obtain Comp. Strength'!$C22^2*Calculations!$P$6+Calculations!$Q$6*'Obtain Comp. Strength'!$C22+Calculations!$R$6+Calculations!$O$6*'Obtain Comp. Strength'!$C22^3","v":0}]
[null,null,null,null,null,null,null,null,{"$f":"('Obtain constants'!E19)","v":0},null,null,null,{"$f":"'Obtain Comp. Strength'!$C23^2*Calculations!$I$6+Calculations!$J$6*'Obtain Comp. Strength'!$C23+Calculations!$K$6","v":0},null,null,null,null,null,null,{"$f":"'Obtain Comp. Strength'!$C23^2*Calculations!$P$6+Calculations!$Q$6*'Obtain Comp. Strength'!$C23+Calculations!$R$6+Calculations!$O$6*'Obtain Comp. Strength'!$C23^3","v":0}]
[null,null,null,null,null,null,null,null,{"$f":"+LINEST(D7:D22,E7:E22^COLUMN($A:$B),TRUE,TRUE)","v":{"$error":"#VALUE!"}},{"$error":"#VALUE!"},{"$error":"#VALUE!"},null,{"$f":"'Obtain Comp. Strength'!$C24^2*Calculations!$I$6+Calculations!$J$6*'Obtain Comp. Strength'!$C24+Calculations!$K$6","v":0},null,null,null,null,null,null,{"$f":"'Obtain Comp. Strength'!$C24^2*Calculations!$P$6+Calculations!$Q$6*'Obtain Comp. Strength'!$C24+Calculations!$R$6+Calculations!$O$6*'Obtain Comp. Strength'!$C24^3","v":0}]
[null,null,null,null,null,null,null,null,{"$error":"#VALUE!"},{"$error":"#VALUE!"},{"$error":"#VALUE!"},null,{"$f":"'Obtain Comp. Strength'!$C25^2*Calculations!$I$6+Calculations!$J$6*'Obtain Comp. Strength'!$C25+Calculations!$K$6","v":0},null,null,null,null,null,null,{"$f":"'Obtain Comp. Strength'!$C25^2*Calculations!$P$6+Calculations!$Q$6*'Obtain Comp. Strength'!$C25+Calculations!$R$6+Calculations!$O$6*'Obtain Comp. Strength'!$C25^3","v":0}]
[null,null,null,null,null,null,null,null,{"$error":"#VALUE!"},{"$error":"#VALUE!"},{"$error":"#VALUE!"},null,{"$f":"'Obtain Comp. Strength'!$C26^2*Calculations!$I$6+Calculations!$J$6*'Obtain Comp. Strength'!$C26+Calculations!$K$6","v":0},null,null,null,null,null,null,{"$f":"'Obtain Comp. Strength'!$C26^2*Calculations!$P$6+Calculations!$Q$6*'Obtain Comp. Strength'!$C26+Calculations!$R$6+Calculations!$O$6*'Obtain Comp. Strength'!$C26^3","v":0}]
[null,null,null,null,null,null,null,null,{"$error":"#VALUE!"},{"$error":"#VALUE!"},{"$error":"#VALUE!"},null,{"$f":"'Obtain Comp. Strength'!$C27^2*Calculations!$I$6+Calculations!$J$6*'Obtain Comp. Strength'!$C27+Calculations!$K$6","v":0},null,null,null,null,null,null,{"$f":"'Obtain Comp. Strength'!$C27^2*Calculations!$P$6+Calculations!$Q$6*'Obtain Comp. Strength'!$C27+Calculations!$R$6+Calculations!$O$6*'Obtain Comp. Strength'!$C27^3","v":0}]
[null,null,null,{"$f":"COUNT(D7:D26)","v":11},null,null,null,null,{"$error":"#VALUE!"},{"$error":"#VALUE!"},{"$error":"#VALUE!"},null,{"$f":"'Obtain Comp. Strength'!$C28^2*Calculations!$I$6+Calculations!$J$6*'Obtain Comp. Strength'!$C28+Calculations!$K$6","v":0},null,null,null,null,null,null,{"$f":"'Obtain Comp. Strength'!$C28^2*Calculations!$P$6+Calculations!$Q$6*'Obtain Comp. Strength'!$C28+Calculations!$R$6+Calculations!$O$6*'Obtain Comp. Strength'!$C28^3","v":0}]
[null,null,null,null,null,null,null,null,null,null,null,null,{"$f":"'Obtain Comp. Strength'!$C29^2*Calculations!$I$6+Calculations!$J$6*'Obtain Comp. Strength'!$C29+Calculations!$K$6","v":0},null,null,null,null,null,null,{"$f":"'Obtain Comp. Strength'!$C29^2*Calculations!$P$6+Calculations!$Q$6*'Obtain Comp. Strength'!$C29+Calculations!$R$6+Calculations!$O$6*'Obtain Comp. Strength'!$C29^3","v":0}]
[null,null,null,null,null,null,null,null,null,null,null,null,{"$f":"'Obtain Comp. Strength'!$C30^2*Calculations!$I$6+Calculations!$J$6*'Obtain Comp. Strength'!$C30+Calculations!$K$6","v":0},null,null,null,null,null,null,{"$f":"'Obtain Comp. Strength'!$C30^2*Calculations!$P$6+Calculations!$Q$6*'Obtain Comp. Strength'!$C30+Calculations!$R$6+Calculations!$O$6*'Obtain Comp. Strength'!$C30^3","v":0}]
[null,null,null,{"$f":"+IF(Calculations!$I$8<Calculations!$O$8,Calculations!O6,\"\")","v":""},null,null,null,null,null,null,null,null,{"$f":"'Obtain Comp. Strength'!$C31^2*Calculations!$I$6+Calculations!$J$6*'Obtain Comp. Strength'!$C31+Calculations!$K$6","v":0},null,null,null,null,null,null,{"$f":"'Obtain Comp. Strength'!$C31^2*Calculations!$P$6+Calculations!$Q$6*'Obtain Comp. Strength'!$C31+Calculations!$R$6+Calculations!$O$6*'Obtain Comp. Strength'!$C31^3","v":0}]
[null,null,null,{"$f":"+IF(Calculations!$I$8<Calculations!$O$8,Calculations!P6,\"\")","v":""},null,null,null,null,null,null,null,null,{"$f":"'Obtain Comp. Strength'!$C32^2*Calculations!$I$6+Calculations!$J$6*'Obtain Comp. Strength'!$C32+Calculations!$K$6","v":0},null,null,null,null,null,null,{"$f":"'Obtain Comp. Strength'!$C32^2*Calculations!$P$6+Calculations!$Q$6*'Obtain Comp. Strength'!$C32+Calculations!$R$6+Calculations!$O$6*'Obtain Comp. Strength'!$C32^3","v":0}]
[null,null,null,{"$f":"+IF(Calculations!$I$8<Calculations!$O$8,Calculations!Q6,\"\")","v":""},null,null,null,null,null,null,null,null,{"$f":"'Obtain Comp. Strength'!$C33^2*Calculations!$I$6+Calculations!$J$6*'Obtain Comp. Strength'!$C33+Calculations!$K$6","v":0},null,null,null,null,null,null,{"$f":"'Obtain Comp. Strength'!$C33^2*Calculations!$P$6+Calculations!$Q$6*'Obtain Comp. Strength'!$C33+Calculations!$R$6+Calculations!$O$6*'Obtain Comp. Strength'!$C33^3","v":0}]
[null,null,null,{"$f":"+IF(Calculations!$I$8<Calculations!$O$8,Calculations!R6,\"\")","v":""},null,null,null,null,null,null,null,null,{"$f":"'Obtain Comp. Strength'!$C34^2*Calculations!$I$6+Calculations!$J$6*'Obtain Comp. Strength'!$C34+Calculations!$K$6","v":0},null,null,null,null,null,null,{"$f":"'Obtain Comp. Strength'!$C34^2*Calculations!$P$6+Calculations!$Q$6*'Obtain Comp. Strength'!$C34+Calculations!$R$6+Calculations!$O$6*'Obtain Comp. Strength'!$C34^3","v":0}]
[null,null,null,null,null,null,null,null,null,null,null,null,{"$f":"'Obtain Comp. Strength'!$C35^2*Calculations!$I$6+Calculations!$J$6*'Obtain Comp. Strength'!$C35+Calculations!$K$6","v":0},null,null,null,null,null,null,{"$f":"'Obtain Comp. Strength'!$C35^2*Calculations!$P$6+Calculations!$Q$6*'Obtain Comp. Strength'!$C35+Calculations!$R$6+Calculations!$O$6*'Obtain Comp. Strength'!$C35^3","v":0}]
[null,null,null,null,null,null,null,null,null,null,null,null,{"$f":"'Obtain Comp. Strength'!$C36^2*Calculations!$I$6+Calculations!$J$6*'Obtain Comp. Strength'!$C36+Calculations!$K$6","v":0},null,null,null,null,null,null,{"$f":"'Obtain Comp. Strength'!$C36^2*Calculations!$P$6+Calculations!$Q$6*'Obtain Comp. Strength'!$C36+Calculations!$R$6+Calculations!$O$6*'Obtain Comp. Strength'!$C36^3","v":0}]
[null,null,null,null,null,null,null,null,null,null,null,null,{"$f":"'Obtain Comp. Strength'!$C37^2*Calculations!$I$6+Calculations!$J$6*'Obtain Comp. Strength'!$C37+Calculations!$K$6","v":0},null,null,null,null,null,null,{"$f":"'Obtain Comp. Strength'!$C37^2*Calculations!$P$6+Calculations!$Q$6*'Obtain Comp. Strength'!$C37+Calculations!$R$6+Calculations!$O$6*'Obtain Comp. Strength'!$C37^3","v":0}]
[null,null,null,null,null,null,null,null,null,null,null,null,{"$f":"'Obtain Comp. Strength'!$C38^2*Calculations!$I$6+Calculations!$J$6*'Obtain Comp. Strength'!$C38+Calculations!$K$6","v":0},null,null,null,null,null,null,{"$f":"'Obtain Comp. Strength'!$C38^2*Calculations!$P$6+Calculations!$Q$6*'Obtain Comp. Strength'!$C38+Calculations!$R$6+Calculations!$O$6*'Obtain Comp. Strength'!$C38^3","v":0}]
[null,null,null,null,null,null,null,null,null,null,null,null,{"$f":"'Obtain Comp. Strength'!$C39^2*Calculations!$I$6+Calculations!$J$6*'Obtain Comp. Strength'!$C39+Calculations!$K$6","v":0},null,null,null,null,null,null,{"$f":"'Obtain Comp. Strength'!$C39^2*Calculations!$P$6+Calculations!$Q$6*'Obtain Comp. Strength'!$C39+Calculations!$R$6+Calculations!$O$6*'Obtain Comp. Strength'!$C39^3","v":0}]
[null,null,null,null,null,null,null,null,null,null,null,null,{"$f":"'Obtain Comp. Strength'!$C40^2*Calculations!$I$6+Calculations!$J$6*'Obtain Comp. Strength'!$C40+Calculations!$K$6","v":0},null,null,null,null,null,null,{"$f":"'Obtain Comp. Strength'!$C40^2*Calculations!$P$6+Calculations!$Q$6*'Obtain Comp. Strength'!$C40+Calculations!$R$6+Calculations!$O$6*'Obtain Comp. Strength'!$C40^3","v":0}]
{"$rows_left_out":115}
{"sheet":"Sheet1","index":3,"n_rows":26,"n_cols":13,"rows_kept":26,"cut":false,"hidden":true,"merged":[]}
[]
[null,null,null,null,null,null,null,"Mean B",{"$f":"AVERAGE(B7:B26)","v":39.92},null,null,"Mean C",{"$f":"+AVERAGE(C7:C26)","v":40.679999999999993}]
[null,null,null,null,null,null,null,"SD B",{"$f":"+STDEV(B7:B26)","v":22.584708380485662},null,null,"SD C",{"$f":"STDEV(C7:C26)","v":22.103979160704135}]
[]
[null,null,null,null,null,null,null,"Compressive Strenght",null,null,null,"SilverSch"]
[null,"Comp St","SS",null,null,null,null,"Z","Outlayer Z>3",null,null,"Z","Outlayer Z>3"]
[{"$f":"'Obtain constants'!B7","v":1},29.5,35.799999999999997,null,null,null,null,{"$f":"(B7-$I$2)/$I$3","v":-0.46137412201449601},{"$f":"ABS(H7)>1.5","v":false},null,null,{"$f":"(C7-$M$2)/$M$3","v":-0.22077472859165237},{"$f":"ABS(L7)>1.5","v":false}]
[{"$f":"'Obtain constants'!B8","v":2},32.6,37.5,null,null,null,null,-0.32411310682784167,{"$f":"ABS(H8)>1.5","v":false},null,null,{"$f":"(C8-$M$2)/$M$3","v":-0.14386549936915033},{"$f":"ABS(L8)>1.5","v":false}]
[{"$f":"'Obtain constants'!B9","v":3},40.299999999999997,45,null,null,null,null,1.6825543797073544E-2,false,null,null,0.19543992367129934,false]
[{"$f":"'Obtain constants'!B10","v":4},41.2,41.8,null,null,null,null,5.6675515948037936E-2,false,null,null,5.0669609840707355E-2,false]
[{"$f":"'Obtain constants'!B11","v":5},44.2,49,null,null,null,null,0.18950875645125173,false,null,null,0.37640281595953917,false]
[{"$f":"'Obtain constants'!B12","v":6},45.3,56,null,null,null,null,0.23821427796909653,false,null,null,0.69308787746395883,false]
[{"$f":"'Obtain constants'!B13","v":7},48.5,49,null,null,null,null,0.37990306783919137,false,null,null,0.37640281595953917,false]
[{"$f":"'Obtain constants'!B14","v":8},50.6,46.8,null,null,null,null,0.4728863361914411,false,null,null,0.27687322520100716,false]
[{"$f":"'Obtain constants'!B15","v":9},51.5,49.5,null,null,null,null,0.51273630834240513,false,null,null,0.39902317749556915,false]
[{"$f":"'Obtain constants'!B16","v":10},52,56,null,null,null,null,0.53487518175960747,false,null,null,0.69308787746395883,false]
[{"$f":"'Obtain constants'!B17","v":11},55.8,57.3,null,null,null,null,0.70313061973034485,false,null,null,0.75190081745763671,false]
[{"$f":"'Obtain constants'!B18","v":12},57,52.8,null,null,null,null,0.75626391593163045,false,null,null,0.54831756363336681,false]
[{"$f":"'Obtain constants'!B19","v":13},58.1,56.5,null,null,null,null,0.80496943744947558,false,null,null,0.71570823899998881,false]
[{"$f":"'Obtain constants'!B20","v":14},60.9,65.5,null,null,null,null,0.9289471285858083,false,null,null,1.1228747466485285,false]
[{"$f":"'Obtain constants'!B21","v":15},62.3,53.8,null,null,null,null,0.99093597415397472,false,null,null,0.59355828670542676,false]
[{"$f":"'Obtain constants'!B22","v":16},68.599999999999994,61.3,null,null,null,null,1.2698857792107237,false,null,null,0.93286370974587651,false]
[{"$f":"'Obtain constants'!B23","v":17},{"$f":"'Obtain constants'!C23","v":0},{"$f":"'Obtain constants'!D23","v":0},null,null,null,null,-1.7675676536294316,true,null,null,-1.8403926145713987,true]
[{"$f":"'Obtain constants'!B24","v":18},{"$f":"'Obtain constants'!C24","v":0},{"$f":"'Obtain constants'!D24","v":0},null,null,null,null,-1.7675676536294316,true,null,null,-1.8403926145713987,true]
[{"$f":"'Obtain constants'!B25","v":19},{"$f":"'Obtain constants'!C25","v":0},{"$f":"'Obtain constants'!D25","v":0},null,null,null,null,-1.7675676536294316,true,null,null,-1.8403926145713987,true]
[{"$f":"'Obtain constants'!B26","v":20},{"$f":"'Obtain constants'!C26","v":0},{"$f":"'Obtain constants'!D26","v":0},null,null,null,null,-1.7675676536294316,true,null,null,-1.8403926145713987,true]